Target
Histone deacetylase 3
Ligand
BDBM242903
Substrate
Meas. Tech.
Fluorogenic Inhibition Assay
pH
8.1±n/a
Temperature
310.15±n/a K
IC50
47300±n/a nM
Comments
extracted
Citation
 Gleason, JLWhite, JHKaldre, DFischer, J Bis-(aryl/heteroaryl)-methylene compounds, pharmaceutical compositions containing same and their use for treating cancer US Patent  US9428447 Publication Date 8/30/2016 
Target
Name:
Histone deacetylase 3
Synonyms:
HD3 HDAC3_HUMAN Human HDAC3 SMAP45
Type:
Enzyme
Mol. Mass.:
48829.55
Organism:
Homo sapiens (Human)
Description:
O15379
Residue:
428
  
Inhibitor
Name:
BDBM242903
Synonyms:
US9428447, DK-178
Type:
Small organic molecule
Emp. Form.:
C26H39NO4S
Mol. Mass.:
461.657
SMILES:
CCC(CC)(c1cc(C)c(CCC(=O)NO)s1)c1ccc(OCC(O)C(C)(C)C)c(C)c1
: