Target
Histone deacetylase 6
Ligand
BDBM242916
Substrate
Meas. Tech.
Fluorogenic Inhibition Assay
pH
8.1±n/a
Temperature
310.15±n/a K
IC50
4700±n/a nM
Comments
extracted
Citation
 Gleason, JLWhite, JHKaldre, DFischer, J Bis-(aryl/heteroaryl)-methylene compounds, pharmaceutical compositions containing same and their use for treating cancer US Patent  US9428447 Publication Date 8/30/2016 
Target
Name:
Histone deacetylase 6
Synonyms:
Cereblon/Histone deacetylase 6 HDAC6 Histone deacetylase 6 (HDAC6) KIAA0901 | ORF Names:JM21
Type:
Chromatin regulator; hydrolase; repressor
Mol. Mass.:
131381.51
Organism:
Homo sapiens (Human)
Description:
Q9UBN7
Residue:
1215
  
Inhibitor
Name:
BDBM242916
Synonyms:
US9428447, JF-B06
Type:
Small organic molecule
Emp. Form.:
C23H30N2O6
Mol. Mass.:
430.4941
SMILES:
CCC(CC)(c1ccc(OCC(=O)NO)c(C)c1)c1ccc(OCC(=O)ON)c(C)c1
: