Target
Coagulation factor XI
Ligand
BDBM246258
Substrate
BDBM246300
Meas. Tech.
Inhibition Assay
pH
7.4±n/a
Temperature
298.15±n/a K
IC50
2.2±n/a nM
Comments
extracted
Citation
 Röhrig, SHillisch, AStraβburger, JHeitmeier, SSchmidt, MVSchlemmer, KTersteegen, ABuchmüller, AGerdes, CSchäfer, MKinzel, TTeller, HSchirok, HKlar, JNunez, EJ Substituted oxopyridine derivatives and use thereof in the treatment of cardiovascular disorders US Patent  US9434690 Publication Date 9/6/2016 
Target
Name:
Coagulation factor XI
Synonyms:
Coagulation factor XIa Coagulation factor XIa light chain FA11_HUMAN Factor XIa PTA | Plasma thromboplastin antecedent
Type:
Enzyme
Mol. Mass.:
70130.58
Organism:
Homo sapiens (Human)
Description:
P03951
Residue:
625
  
Inhibitor
Name:
BDBM246258
Synonyms:
US10183932, Example 164 US9822102, Example 164
Type:
Small organic molecule
Emp. Form.:
C25H22ClN5O5
Mol. Mass.:
507.926
SMILES:
COCCC(C(=O)Nc1ccc2c(c1)[nH][nH]c2=O)n1cc(OC)c(cc1=O)-c1cc(Cl)ccc1C#N
:
Substrate
Name:
BDBM246300
Synonyms:
US9434690, BOC-GLU(OBZL)-ALA-ARG-AMC
Type:
Substrate
Emp. Form.:
C36H47N7O9
Mol. Mass.:
721.7999
SMILES:
[#6]-[#6@H](-[#7]-[#6](=O)-[#6@H](-[#6]-[#6]-[#6](=O)-[#8]-[#6]-c1ccccc1)-[#7]-[#6](=O)-[#8]C([#6])([#6])[#6])-[#6](=O)-[#7]-[#6@@H](-[#6]-[#6]-[#6]\[#7]=[#6](\[#7])-[#7])-[#6](=O)-[#7]-c1ccc2c(-[#6])cc(=O)oc2c1
: