Target
Short transient receptor potential channel 5
Ligand
BDBM246456
Substrate
Meas. Tech.
High Throughput Screening Assay
pH
7.4±n/a
Temperature
298.15±n/a K
IC50
27±n/a nM
Comments
extracted
Citation
 Chenard, BLGallaschun, RJ Thieno- and furo[2,3-d]pyrimidine-2,4[1H,3H]-dione derivatives US Patent  US9447114 Publication Date 9/20/2016 
Target
Name:
Short transient receptor potential channel 5
Synonyms:
TRP5 TRPC5_HUMAN | Transient receptor protein 5 (TRPC5)
Type:
Enzyme
Mol. Mass.:
111421.47
Organism:
Homo sapiens (Human)
Description:
Q9UL62
Residue:
973
  
Inhibitor
Name:
BDBM246456
Synonyms:
US9447114, 16
Type:
Small organic molecule
Emp. Form.:
C17H17ClN2O3S
Mol. Mass.:
364.846
SMILES:
Cc1c(sc2n(C)c(=O)n(CCCO)c(=O)c12)-c1ccccc1Cl
: