Target
Isocitrate dehydrogenase [NADP] cytoplasmic
Ligand
BDBM247785
Substrate
Meas. Tech.
LC-MS Detection of 2-HG Assay
pH
7.4±n/a
Temperature
298.15±n/a K
IC50
6±n/a nM
Comments
extracted
Citation
 Caferro, TRChen, ZCho, YSCostales, AQLevell, JRLiu, GManning, JRSendzik, MShafer, CShultz, MDSutton, JWang, YZhao, Q 3-pyrimidin-4-yl-oxazolidin-2-ones as inhibitors of mutant IDH US Patent  US9434719 Publication Date 9/6/2016 
Target
Name:
Isocitrate dehydrogenase [NADP] cytoplasmic
Synonyms:
Cytosolic NADP-isocitrate dehydrogenase IDH1 IDP Isocitrate dehydrogenase 1 (IDH1) Oxalosuccinate decarboxylase | PICD
Type:
Protein
Mol. Mass.:
46661.29
Organism:
Homo sapiens (Human)
Description:
O75874
Residue:
414
  
Inhibitor
Name:
BDBM247785
Synonyms:
US10112931, Example 388 US9688672, Example 388
Type:
Small organic molecule
Emp. Form.:
C20H20ClFN6O2
Mol. Mass.:
430.863
SMILES:
C[C@H](F)[C@H]1COC(=O)N1c1ccnc(N[C@@H](C)c2cn(cn2)-c2ccc(Cl)cc2)n1
: