Target
Isocitrate dehydrogenase [NADP] cytoplasmic
Ligand
BDBM247952
Substrate
Meas. Tech.
LC-MS Detection of 2-HG Assay
pH
7.4±n/a
Temperature
298.15±n/a K
IC50
6429±n/a nM
Comments
extracted
Citation
 Caferro, TRChen, ZCho, YSCostales, AQLevell, JRLiu, GManning, JRSendzik, MShafer, CShultz, MDSutton, JWang, YZhao, Q 3-pyrimidin-4-yl-oxazolidin-2-ones as inhibitors of mutant IDH US Patent  US9434719 Publication Date 9/6/2016 
Target
Name:
Isocitrate dehydrogenase [NADP] cytoplasmic
Synonyms:
Cytosolic NADP-isocitrate dehydrogenase IDH1 IDP Isocitrate dehydrogenase 1 (IDH1) Oxalosuccinate decarboxylase | PICD
Type:
Protein
Mol. Mass.:
46661.29
Organism:
Homo sapiens (Human)
Description:
O75874
Residue:
414
  
Inhibitor
Name:
BDBM247952
Synonyms:
US9434719, 424
Type:
Small organic molecule
Emp. Form.:
C19H19ClN6O4
Mol. Mass.:
430.845
SMILES:
C[C@@H](O)C1COC(=O)N1c1ccnc(NC(C)c2noc(n2)-c2ccc(Cl)cc2)n1
: