Target
Alpha-1,3-mannosyl-glycoprotein 2-beta-N-acetylglucosaminyltransferase
Ligand
BDBM294253
Substrate
Meas. Tech.
Radioligand Binding Assay
Ki
<100.0±n/a nM
Citation
 Amberg, WPohlki, FLange, UWang, YBrewer, JVasudevan, ALao, YHutchins, CZhao, HLi, H Aminochromane, aminothiochromane and amino-1,2,3,4-tetrahydroquinoline derivatives, pharmaceutical compositions containing them, and their use in therapy US Patent  US9586945 Publication Date 3/7/2017 
Target
Name:
Alpha-1,3-mannosyl-glycoprotein 2-beta-N-acetylglucosaminyltransferase
Synonyms:
GGNT1 GLYT1 GlcNAc-T I MGAT1 N-glycosyl-oligosaccharide-glycoprotein N-acetylglucosaminyltransferase I
Type:
PROTEIN
Mol. Mass.:
50891.32
Organism:
Homo sapiens (Human)
Description:
ChEMBL_107587
Residue:
445
  
Inhibitor
Name:
BDBM294253
Synonyms:
Cis-N-(1-(3-(azetidin-1-yl)-4-benzylchroman-6-yl)azetidin-3-yl)-2-fluoropyridine-3-sulfonamide | US9586945, 10
Type:
Small organic molecule
Emp. Form.:
C27H29FN4O3S
Mol. Mass.:
508.608
SMILES:
Fc1ncccc1S(=O)(=O)NC1CN(C1)c1ccc2OCC(C(Cc3ccccc3)c2c1)N1CCC1
: