Target
Isoform 2 of Nuclear receptor ROR-gamma (RORgT)
Ligand
BDBM256395
Substrate
Meas. Tech.
TR-FRET Assay
pH
7±n/a
Temperature
277.15±n/a K
IC50
15±n/a nM
Comments
extracted
Citation
 Barr, KJMaclean, JKZhang, HBeresis, RTZhang, DAndresen, BMAnthony, NJLapointe, BTSciammetta, N 3-cyclohexenyl and cyclohexyl substituted indole and indazole compounds as RORgammaT inhibitors and uses thereof US Patent  US9487490 Publication Date 11/8/2016 
Target
Name:
Isoform 2 of Nuclear receptor ROR-gamma (RORgT)
Synonyms:
Isoform 2 of Nuclear receptor ROR-gamma Nuclear receptor ROR-gamma (RORgT) RORC RORG_HUMAN Retinoid-related orphan receptor-gamma (RORgT) | Retinoid-related orphan receptor-gamma (RORĪ³T)
Type:
Protein
Mol. Mass.:
55831.73
Organism:
Homo sapiens (Human)
Description:
P51449-2
Residue:
497
  
Inhibitor
Name:
BDBM256395
Synonyms:
US9487490, 6B
Type:
Small organic molecule
Emp. Form.:
C22H15ClF4N2O4
Mol. Mass.:
482.812
SMILES:
OC1CC(=CCC1C(O)=O)c1nn(C(=O)c2c(Cl)cccc2C(F)(F)F)c2cccc(F)c12
: