Target
Amine oxidase [flavin-containing] B
Ligand
BDBM256490
Substrate
Meas. Tech.
Biological Assay
pH
7.5±n/a
Temperature
310.15±n/a K
IC50
18690±n/a nM
Comments
extracted
Citation
 Ortega Muñoz, AFyfe, MCMartinell Pedemonte, MEstiarte Martinez, MValls Vidal, NKurz, GCastro Palomino Laria, JC (Hetero)aryl cyclopropylamine compounds as LSD1 inhibitors US Patent  US9487512 Publication Date 11/8/2016 
Target
Name:
Amine oxidase [flavin-containing] B
Synonyms:
AOFB_HUMAN MAOB Monoamine oxidase type B (MAO B) Monoamine oxidase type B (MAOB)
Type:
Protein
Mol. Mass.:
58768.76
Organism:
Homo sapiens (Human)
Description:
P27338
Residue:
520
  
Inhibitor
Name:
BDBM256490
Synonyms:
US10329256, Example 35 US9944601, Example 35
Type:
Small organic molecule
Emp. Form.:
C14H18BrNO
Mol. Mass.:
296.203
SMILES:
Brc1ccc(cc1)[C@H]1C[C@@H]1NC1CCOCC1
: