Target
Integrin alpha-4/Integrin beta-1/Vascular cell adhesion protein 1
Ligand
BDBM260671
Substrate
Meas. Tech.
Binding Inhibition Assay
pH
9.6±n/a
Temperature
277.15±n/a K
IC50
22±n/a nM
Comments
extracted
Citation
 Ueno, HYamamoto, TTakashita, RYokoyama, RSugiura, TKageyama, SAndo, AEda, HEviryanti, AMiyazawa, TKirihara, ATanabe, INakamura, TNoguchi, MShuto, MSugiki, MDohi, M Sulfonamide derivative and medicinal use thereof US Patent  US9533985 Publication Date 1/3/2017 
Target
Name:
Integrin alpha-4/Integrin beta-1/Vascular cell adhesion protein 1
Synonyms:
Vascular cell adhesion protein 1 (VCAM-1)/Alpha-4 Beta-1 Integrin
Type:
Enzyme
Mol. Mass.:
Description:
Components:
This complex has 3 components.
Component 1
Name:
Vascular cell adhesion protein 1
Synonyms:
CD106 antigen VCAM-1 VCAM1_HUMAN Vascular cell adhesion protein 1 (VCAM-1) | Vascular cell adhesion protein 1 precursor
Type:
Other Protein Type
Mol. Mass.:
81259.16
Organism:
Homo sapiens (Human)
Description:
P19320
Residue:
739
  
Component 2
Name:
Integrin alpha-4
Synonyms:
CD49 antigen-like family member D CD49d antigen ITA4_HUMAN Integrin alpha-4 Integrin alpha-IV VLA-4 integrin alpha 4 precursor | integrin alpha-4 precursor
Type:
Membrane Protein
Mol. Mass.:
114897.35
Organism:
Homo sapiens (Human)
Description:
P13612
Residue:
1032
  
Component 3
Name:
Integrin beta-1
Synonyms:
CD_antigen=CD29 Fibronectin receptor beta GPIIA ITGB1 MDF2 | MSK12
Type:
Enzyme
Mol. Mass.:
88400.38
Organism:
Homo sapiens (Human)
Description:
P05556
Residue:
798
  
Inhibitor
Name:
BDBM260671
Synonyms:
US9533985, 59
Type:
Small organic molecule
Emp. Form.:
C32H23F2N7O7S2
Mol. Mass.:
719.695
SMILES:
Cn1c2cnccc2c(=O)n(-c2ccc(C[C@H](NC(=O)c3c(F)cc(NS(=O)(=O)c4ccc(cn4)-c4nccs4)cc3F)C(O)=O)cc2)c1=O
: