Target
Cyclin-dependent kinase 2/G1/S-specific cyclin-E1
Ligand
BDBM6752
Substrate
ING Peptide
Meas. Tech.
CDK Kinase Inhibition Assay
Temperature
298.15±n/a K
IC50
>2000±n/a nM
Comments
extracted
Citation
 Zhu, GConner, SEZhou, XChan, HKShih, CEngler, TAAl-Awar, RSBrooks, HBWatkins, SASpencer, CDSchultz, RMDempsey, JAConsidine, ELPatel, BROgg, CAVasudevan, VLytle, ML Synthesis of 1,7-annulated indoles and their applications in the studies of cyclin dependent kinase inhibitors. Bioorg Med Chem Lett 14:3057-61 (2004)  
Target
Name:
Cyclin-dependent kinase 2/G1/S-specific cyclin-E1
Synonyms:
CDK2/CycE CDK2/E Cyclin-Dependent Kinase 2 (CDK2) Cyclin-dependent kinase 2/cyclin E1
Type:
Protein
Mol. Mass.:
Description:
Components:
This complex has 2 components.
Component 1
Name:
Cyclin-dependent kinase 2
Synonyms:
CDK2 CDK2_HUMAN Cell division protein kinase 2 Protein cereblon/Cyclin-dependent kinase 2 | p33 protein kinase
Type:
Enzyme Subunit
Mol. Mass.:
33938.17
Organism:
Homo sapiens (Human)
Description:
P24941
Residue:
298
  
Component 2
Name:
G1/S-specific cyclin-E1
Synonyms:
CCNE CCNE1_HUMAN
Type:
Enzyme Subunit
Mol. Mass.:
47073.17
Organism:
Homo sapiens (Human)
Description:
Residue:
410
  
Inhibitor
Name:
BDBM6752
Synonyms:
1,7-Annulated indolocarbazole deriv. 13Bf | 25-(hydroxymethyl)-1,15-diazaheptacyclo[17.7.1.0^{2,18}.0^{3,12}.0^{6,11}.0^{13,17}.0^{23,27}]heptacosa-2(18),3(12),4,6(11),7,9,13(17),19(27),20,22-decaene-14,16-dione
Type:
Small organic molecule
Emp. Form.:
C26H18N2O3
Mol. Mass.:
406.4327
SMILES:
OCC1Cc2cccc3c4c5C(=O)NC(=O)c5c5c(ccc6ccccc56)c4n(C1)c23
:
Substrate
Name:
ING Peptide
Synonyms:
Type:
Peptide
Mol. Mass.:
1341.50
Organism:
Description:
amino acid residues 246-257 from human retinoblastoma 1 protein.
Residue:
12
INGSPRTPRRGQ