Target
Alkaline phosphatase, tissue-nonspecific isozyme
Ligand
BDBM409926
Substrate
Meas. Tech.
Enzyme Kinetic Assay
IC50
550±n/a nM
Citation
 Pinkerton, ABDahl, RCosford, NDMillan, JL Sulfonamide compounds and uses as TNAP inhibitors US Patent  US10370333 Publication Date 8/6/2019 
Target
Name:
Alkaline phosphatase, tissue-nonspecific isozyme
Synonyms:
ALPL tissue-nonspecific alkaline phosphatase precursor
Type:
PROTEIN
Mol. Mass.:
57306.17
Organism:
Homo sapiens (Human)
Description:
ChEMBL_1448917
Residue:
524
  
Inhibitor
Name:
BDBM409926
Synonyms:
US10370333, Example XII-1
Type:
Small organic molecule
Emp. Form.:
C14H10ClF3N2O5S
Mol. Mass.:
410.753
SMILES:
COC(=O)c1cncc(NS(=O)(=O)c2cc(Cl)ccc2OC(F)(F)F)c1
: