Target
Nuclear receptor ROR-gamma
Ligand
BDBM310135
Substrate
Meas. Tech.
RORgamma-Ligand Binding Domain TR-FRET Assay Protocol II
EC50
12.0±n/a nM
Citation
 Aicher, TDBarr, KJLapointe, BTSimov, VStein, KAThomas, WDToogood, PLVan Huis, CAWhite, CM Tetrahydronaphthyridine and related bicyclic compounds for inhibition of RORgamma activity and the treatment of disease US Patent  US10377768 Publication Date 8/13/2019 
Target
Name:
Nuclear receptor ROR-gamma
Synonyms:
NR1F3 Nuclear receptor ROR-gamma (RORC) RAR-related orphan receptor C (RORc) RORG RZRG Retinoid-related orphan receptor-gamma (RORc)
Type:
Enzyme Catalytic Domain
Mol. Mass.:
58218.40
Organism:
Homo sapiens (Human)
Description:
P51449
Residue:
518
  
Inhibitor
Name:
BDBM310135
Synonyms:
US10377768, Compound 49 | US9657033, Compound 49
Type:
Small organic molecule
Emp. Form.:
C22H17ClF6N6O4S
Mol. Mass.:
610.917
SMILES:
Cc1nn(cc1S(=O)(=O)N1C[C@H](Cc2ncc(NC(=O)c3c(F)cccc3Cl)cc12)NC(=O)C(F)(F)F)C(F)F
: