Target
Histone deacetylase 1
Ligand
BDBM411342
Substrate
Meas. Tech.
Enzyme Assays
IC50
<10±n/a nM
Citation
 van Duzer, JHMazitschek, R Substituted piperazines as selective HDAC1,2 inhibitors US Patent  US10385031 Publication Date 8/20/2019 
Target
Name:
Histone deacetylase 1
Synonyms:
Cereblon/Histone deacetylase 1 HDAC1 Histone deacetylase 1 (HDAC1) RPD3L1
Type:
Enzyme
Mol. Mass.:
55090.27
Organism:
Homo sapiens (Human)
Description:
Q13547
Residue:
482
  
Inhibitor
Name:
BDBM411342
Synonyms:
US10385031, Compound 048 US11542242, Compound 048
Type:
Small organic molecule
Emp. Form.:
C21H23N5OS
Mol. Mass.:
393.505
SMILES:
CN1CCN(CC1)c1ncc(s1)C(=O)Nc1cc(ccc1N)-c1ccccc1
: