Target
Histone deacetylase 3
Ligand
BDBM411350
Substrate
Meas. Tech.
Enzyme Assays
IC50
>500±n/a nM
Citation
 van Duzer, JHMazitschek, R Substituted piperazines as selective HDAC1,2 inhibitors US Patent  US10385031 Publication Date 8/20/2019 
Target
Name:
Histone deacetylase 3
Synonyms:
HD3 HDAC3_HUMAN Human HDAC3 SMAP45
Type:
Enzyme
Mol. Mass.:
48829.55
Organism:
Homo sapiens (Human)
Description:
O15379
Residue:
428
  
Inhibitor
Name:
BDBM411350
Synonyms:
US10385031, Compound 056 US11542242, Compound 056
Type:
Small organic molecule
Emp. Form.:
C18H19N5O2S
Mol. Mass.:
369.441
SMILES:
Nc1ccc(cc1NC(=O)c1nc(cs1)N1CCNCC1)-c1ccoc1
: