Target
Histone deacetylase 2
Ligand
BDBM411362
Substrate
Meas. Tech.
Enzyme Assays
IC50
<1000±n/a nM
Citation
 van Duzer, JHMazitschek, R Substituted piperazines as selective HDAC1,2 inhibitors US Patent  US10385031 Publication Date 8/20/2019 
Target
Name:
Histone deacetylase 2
Synonyms:
Cereblon/Histone deacetylase 2 HDAC2 Histone deacetylase 2 (HDAC2) | Human HDAC2
Type:
Chromatin regulator; hydrolase; repressor
Mol. Mass.:
55356.54
Organism:
Homo sapiens (Human)
Description:
Q92769
Residue:
488
  
Inhibitor
Name:
BDBM411362
Synonyms:
US10385031, Compound 068 US11542242, Compound 068
Type:
Small organic molecule
Emp. Form.:
C21H21FN4OS
Mol. Mass.:
396.481
SMILES:
Nc1ccc(cc1NC(=O)c1ccc(s1)N1CCNCC1)-c1ccc(F)cc1
: