Target
Nuclear receptor ROR-gamma
Ligand
BDBM411393
Substrate
Meas. Tech.
TR-FRET (time-resolved fluorescence resonance energy transfer) assay
IC50
14.8±n/a nM
Citation
 Schnute, MEFlick, ACJones, PKaila, NMente, SRTrzupek, JDVazquez, MLWennerstal, GMXing, LZamaratski, EZhang, LUnwalla, RJ Sulfonamide-substituted indole modulators of RORC2 and methods of use thereof US Patent  US10385036 Publication Date 8/20/2019 
Target
Name:
Nuclear receptor ROR-gamma
Synonyms:
NR1F3 Nuclear receptor ROR-gamma (RORC) RAR-related orphan receptor C (RORc) RORG RZRG Retinoid-related orphan receptor-gamma (RORc)
Type:
Enzyme Catalytic Domain
Mol. Mass.:
58218.40
Organism:
Homo sapiens (Human)
Description:
P51449
Residue:
518
  
Inhibitor
Name:
BDBM411393
Synonyms:
4-fluoro-N-(1-methyl-3-(1-(4,4,4-trifluoro-3- methylbutanoyl)piperidin-4-yl)-1H-indol-5- yl)benzenesulfonamide | US10385036, Example 9
Type:
Small organic molecule
Emp. Form.:
C25H27F4N3O3S
Mol. Mass.:
525.559
SMILES:
CC(CC(=O)N1CCC(CC1)c1cn(C)c2ccc(NS(=O)(=O)c3ccc(F)cc3)cc12)C(F)(F)F
: