Target
Cyclin-dependent kinase 2/G1/S-specific cyclin-E1
Ligand
BDBM6797
Substrate
ING Peptide
Meas. Tech.
CDK Kinase Inhibition Assay
Temperature
298.15±n/a K
IC50
10±n/a nM
Comments
extracted
Citation
 Engler, TAFurness, KMalhotra, SSanchez-Martinez, CShih, CXie, WZhu, GZhou, XConner, SFaul, MMSullivan, KAKolis, SPBrooks, HBPatel, BSchultz, RMDeHahn, TBKirmani, KSpencer, CDWatkins, SAConsidine, ELDempsey, JAOgg, CAStamm, NBAnderson, BDCampbell, RMVasudevan, VLytle, ML Novel, potent and selective cyclin D1/CDK4 inhibitors: indolo[6,7-a]pyrrolo[3,4-c]carbazoles. Bioorg Med Chem Lett 13:2261-7 (2003)  
Target
Name:
Cyclin-dependent kinase 2/G1/S-specific cyclin-E1
Synonyms:
CDK2/CycE CDK2/E Cyclin-Dependent Kinase 2 (CDK2) Cyclin-dependent kinase 2/cyclin E1
Type:
Protein
Mol. Mass.:
Description:
Components:
This complex has 2 components.
Component 1
Name:
Cyclin-dependent kinase 2
Synonyms:
CDK2 CDK2_HUMAN Cell division protein kinase 2 Protein cereblon/Cyclin-dependent kinase 2 | p33 protein kinase
Type:
Enzyme Subunit
Mol. Mass.:
33938.17
Organism:
Homo sapiens (Human)
Description:
P24941
Residue:
298
  
Component 2
Name:
G1/S-specific cyclin-E1
Synonyms:
CCNE CCNE1_HUMAN
Type:
Enzyme Subunit
Mol. Mass.:
47073.17
Organism:
Homo sapiens (Human)
Description:
Residue:
410
  
Inhibitor
Name:
BDBM6797
Synonyms:
18-methyl-12,14-dioxo-3,13,18-triazahexacyclo[14.7.0.0^{2,10}.0^{4,9}.0^{11,15}.0^{17,21}]tricosa-1(16),2(10),4(9),5,7,11(15),17(21),19,22-nonaene-6-carbonitrile | indolo[6,7-a]pyrrolo[3,4-c]carbazole deriv. 3p
Type:
Small organic molecule
Emp. Form.:
C22H12N4O2
Mol. Mass.:
364.3563
SMILES:
Cn1ccc2ccc3c4[nH]c5cc(ccc5c4c4C(=O)NC(=O)c4c3c12)C#N
:
Substrate
Name:
ING Peptide
Synonyms:
Type:
Peptide
Mol. Mass.:
1341.50
Organism:
Description:
amino acid residues 246-257 from human retinoblastoma 1 protein.
Residue:
12
INGSPRTPRRGQ