Target
RNA-directed RNA polymerase L
Ligand
BDBM412217
Substrate
Meas. Tech.
RSV assay
EC50
<400±n/a nM
Citation
 Shook, BCKim, IJYu, JBlaisdell, TPPanarese, JOr, YS Heteroaryldiazepine derivatives as RSV inhibitors US Patent  US10398706 Publication Date 9/3/2019 
Target
Name:
RNA-directed RNA polymerase L
Synonyms:
Large structural protein | Protein L
Type:
Enzyme Catalytic Domain
Mol. Mass.:
250571.66
Organism:
Respiratory syncytial virus type A
Description:
Residue:
2165
  
Inhibitor
Name:
BDBM412217
Synonyms:
US10398706, Example 6 | US10398706, Example 7
Type:
Small organic molecule
Emp. Form.:
C12H11NOS
Mol. Mass.:
217.287
SMILES:
Cc1cc(C(=O)c2ccccc2)c(N)s1
: