Target
Coagulation factor XI
Ligand
BDBM413470
Substrate
Meas. Tech.
Inhibition Assay
IC50
14.0±n/a nM
Citation
 Röhrig, SHillisch, AHeitmeier, SSchmidt, MVSchlemmer, KTersteegen, ATeller, H Substituted oxopyridine derivatives US Patent  US10414731 Publication Date 9/17/2019 
Target
Name:
Coagulation factor XI
Synonyms:
Coagulation factor XIa Coagulation factor XIa light chain FA11_HUMAN Factor XIa PTA | Plasma thromboplastin antecedent
Type:
Enzyme
Mol. Mass.:
70130.58
Organism:
Homo sapiens (Human)
Description:
P03951
Residue:
625
  
Inhibitor
Name:
BDBM413470
Synonyms:
(3S)-3-{[4-({2-[4-(5-Chloro-2-cyanophenyl)-5-methoxy-2-oxopyridin-1(2H)-yl]butanoyl}-amino)benzoyl]oxy}-L-proline (Enantiomerically Pure Diastereomer) | US10414731, Example 10
Type:
Small organic molecule
Emp. Form.:
C29H27ClN4O7
Mol. Mass.:
579
SMILES:
CCC(C(=O)Nc1ccc(cc1)C(=O)O[C@H]1CCN[C@@H]1C(O)=O)n1cc(OC)c(cc1=O)-c1cc(Cl)ccc1C#N
: