Target
5-hydroxytryptamine receptor 7
Ligand
BDBM50458563
Substrate
Meas. Tech.
Measurement of Binding Affinity for Serotonin 5-HT7 Receptor
Ki
1407±n/a nM
Citation
 Choo, HKim, YSeong, JNam, GSCho, YS Azepine derivatives as 5-HT7 receptor modulators US Patent  US10435408 Publication Date 10/8/2019 
Target
Name:
5-hydroxytryptamine receptor 7
Synonyms:
5-HT-7 5-HT7 5-HT7S 5HT7 HTR7 | Serotonin receptor 7
Type:
G Protein-Coupled Receptor (GPCR)
Mol. Mass.:
53573.08
Organism:
Homo sapiens (Human)
Description:
P34969
Residue:
479
  
Inhibitor
Name:
BDBM50458563
Synonyms:
CHEMBL4211303
Type:
Small organic molecule
Emp. Form.:
C13H13FN2O
Mol. Mass.:
232.2535
SMILES:
Fc1cccc(c1)-c1noc2CCNCCc12
: