Target
Histone deacetylase 9
Ligand
BDBM272069
Substrate
Meas. Tech.
Analysis of Inhibition of HDAC9 with the Compounds
IC50
53.0±n/a nM
Citation
 Dominguez, CMuñoz-Sanjuán, IBürli, RWLuckhurst, CAAllen, DRRaphy, GBreccia, PHaughan, AFWishart, GHughes, SJJarvis, REVater, HDPenrose, SDWall, MStott, AJSaville-Stones, EA Histone deacetylase inhibitors and compositions and methods of use thereof US Patent  US10457675 Publication Date 10/29/2019 
Target
Name:
Histone deacetylase 9
Synonyms:
HD9 HDAC7B HDAC9_HUMAN Histone acetylase 9 (HDAC9) Histone deacetylase 9 (HDAC9) Human HDAC9 MITR
Type:
Enzyme
Mol. Mass.:
111304.31
Organism:
Homo sapiens (Human)
Description:
Q9UKV0
Residue:
1011
  
Inhibitor
Name:
BDBM272069
Synonyms:
(S)-5-(3-Fluoro-2-methylphenyl)-1-(4-fluorophenyl)- N-hydroxy-1,4,5,6-tetrahydrocyclopenta[c]pyrazole-5- carboxamide US10457675, Example 5
Type:
Small organic molecule
Emp. Form.:
C20H17F2N3O2
Mol. Mass.:
369.3647
SMILES:
Cc1c(F)cccc1[C@@]1(Cc2cnn(c2C1)-c1ccc(F)cc1)C(=O)NO
: