Target
Mitogen-activated protein kinase kinase kinase 5
Ligand
BDBM419096
Substrate
Meas. Tech.
HTRF KinEASE Assay
IC50
55±n/a nM
Citation
 Granger, BWang, GShen, RHe, JHe, YXing, XMa, JLong, JWang, BOr, YS Apoptosis signal-regulating kinase 1 inhibitors and methods of use thereof US Patent  US10450301 Publication Date 10/22/2019 
Target
Name:
Mitogen-activated protein kinase kinase kinase 5
Synonyms:
ASK1 MAP3K5 MEKK5
Type:
Protein
Mol. Mass.:
154514.93
Organism:
Homo sapiens (Human)
Description:
Q99683
Residue:
1374
  
Inhibitor
Name:
BDBM419096
Synonyms:
US10450301, Example 175
Type:
Small organic molecule
Emp. Form.:
C23H26N6O3
Mol. Mass.:
434.4909
SMILES:
COc1cc2CN(C(C)C)C(=O)c2cc1C(=O)Nc1cccc(n1)-c1nncn1C(C)C
: