Target
Mitogen-activated protein kinase kinase kinase 5
Ligand
BDBM419112
Substrate
Meas. Tech.
HTRF KinEASE Assay
IC50
>1000±n/a nM
Citation
 Granger, BWang, GShen, RHe, JHe, YXing, XMa, JLong, JWang, BOr, YS Apoptosis signal-regulating kinase 1 inhibitors and methods of use thereof US Patent  US10450301 Publication Date 10/22/2019 
Target
Name:
Mitogen-activated protein kinase kinase kinase 5
Synonyms:
ASK1 MAP3K5 MEKK5
Type:
Protein
Mol. Mass.:
154514.93
Organism:
Homo sapiens (Human)
Description:
Q99683
Residue:
1374
  
Inhibitor
Name:
BDBM419112
Synonyms:
US10450301, Example 183a
Type:
Small organic molecule
Emp. Form.:
C25H30N6O3
Mol. Mass.:
462.5441
SMILES:
CC(C)n1cnnc1-c1cccc(NC(=O)c2ccc3CCN(Cc3c2)C(=O)OC(C)(C)C)n1
: