Target
Cannabinoid receptor 2
Ligand
BDBM419288
Substrate
Meas. Tech.
Radioligand Binding Assay
Ki
210±n/a nM
Citation
 Gobbi, LGrether, UGuba, WKretz, JMartin, REWestphal, MVIjzerman, AP [1,2,3]triazolo[4,5-D]pyrimidine derivatives with affinity for the type-2 cannabinoid receptor US Patent  US10457685 Publication Date 10/29/2019 
Target
Name:
Cannabinoid receptor 2
Synonyms:
CANNABINOID CB2 CB2 CB2B CNR2_HUMAN Cannabinoid CB2 receptor Cannabinoid receptor 2 (CB2R) | hCB2
Type:
G Protein-Coupled Receptor (GPCR)
Mol. Mass.:
39690.94
Organism:
Homo sapiens (Human)
Description:
P34972
Residue:
360
  
Inhibitor
Name:
BDBM419288
Synonyms:
7-(3-Azidopyrrolidin-1-yl)-5-tert-butyl-3-[(2-chlorophenyl)methyl]-3H-[1,2,3]triazolo[4,5-d]pyrimidine | US10457685, Example 17
Type:
Small organic molecule
Emp. Form.:
C19H22ClN9
Mol. Mass.:
411.891
SMILES:
CC(C)(C)c1nc(N2CCC(C2)N=[N+]=[N-])c2nnn(Cc3ccccc3Cl)c2n1
: