Target
Cannabinoid receptor 1
Ligand
BDBM419292
Substrate
Meas. Tech.
Radioligand Binding Assay
Ki
2453±n/a nM
Citation
 Gobbi, LGrether, UGuba, WKretz, JMartin, REWestphal, MVIjzerman, AP [1,2,3]triazolo[4,5-D]pyrimidine derivatives with affinity for the type-2 cannabinoid receptor US Patent  US10457685 Publication Date 10/29/2019 
Target
Name:
Cannabinoid receptor 1
Synonyms:
CANN6 CB-R CNR CNR1_HUMAN Cannabinoid receptor Cannabinoid receptor 1 (brain)
Type:
G Protein-Coupled Receptor (GPCR)
Mol. Mass.:
52868.96
Organism:
Homo sapiens (Human)
Description:
P21554
Residue:
472
  
Inhibitor
Name:
BDBM419292
Synonyms:
7-(3-Azidopyrrolidin-1-yl)-3-[(2-chlorophenyl)methyl]-5-[difluoro(phenyl)methyl]-3H-[1,2,3]triazolo[4,5-d]pyrimidine | US10457685, Example 21
Type:
Small organic molecule
Emp. Form.:
C22H18ClF2N9
Mol. Mass.:
481.888
SMILES:
FC(F)(c1ccccc1)c1nc(N2CCC(C2)N=[N+]=[N-])c2nnn(Cc3ccccc3Cl)c2n1
: