Target
Cannabinoid receptor 1
Ligand
BDBM419312
Substrate
Ki
>10000±n/a nM
Citation
 Gobbi, LGrether, UGuba, WKretz, JMartin, REWestphal, MV [1,2,3]triazolo[4,5-D]pyrimidine derivatives US Patent  US10457686 Publication Date 10/29/2019 
Target
Name:
Cannabinoid receptor 1
Synonyms:
CANN6 CB-R CNR CNR1_HUMAN Cannabinoid receptor Cannabinoid receptor 1 (brain)
Type:
G Protein-Coupled Receptor (GPCR)
Mol. Mass.:
52868.96
Organism:
Homo sapiens (Human)
Description:
P21554
Residue:
472
  
Inhibitor
Name:
BDBM419312
Synonyms:
4-({5-tert-Butyl-7-[(3S)-3-hydroxypyrrolidin-1-yl]-2H-[1,2,3]triazolo[4,5-d]pyrimidin-2-yl}methyl)-N-{2-[3-(but-3-yn-1-yl)-3H-diaziren-3-yl]ethyl}-1,2,5-oxadiazole-3-carboxamide | US10457686, Example 3
Type:
Small organic molecule
Emp. Form.:
C23H29N11O3
Mol. Mass.:
507.5483
SMILES:
CC(C)(C)c1nc(N2CC[C@H](O)C2)c2nn(Cc3nonc3C(=O)NCCC3(CCC#C)N=N3)nc2n1
: