Target
Activated CDC42 kinase 1
Ligand
BDBM419722
Substrate
Meas. Tech.
Inhibition Assay
IC50
6.47±n/a nM
Citation
 Lee, HChun, KJoe, BKim, ESJang, ESOh, HKim, JPark, JLee, H Tricyclic derivative compound, method for preparing same, and pharmaceutical composition comprising same US Patent  US10464919 Publication Date 11/5/2019 
Target
Name:
Activated CDC42 kinase 1
Synonyms:
ACK1 Activated CDC42 kinase 1 (ACK-1) Tyrosine kinase non-receptor protein 2
Type:
Protein
Mol. Mass.:
114577.86
Organism:
Homo sapiens (Human)
Description:
Q07912
Residue:
1038
  
Inhibitor
Name:
BDBM419722
Synonyms:
US10464919, Example 60
Type:
Small organic molecule
Emp. Form.:
C24H24FN5O
Mol. Mass.:
417.4787
SMILES:
Fc1cc(ccc1C#N)N1CCN(Cc2ccc3c4NCCCc4c(=O)[nH]c3c2)CC1
: