Target
Activated CDC42 kinase 1
Ligand
BDBM419832
Substrate
Meas. Tech.
Inhibition Assay
IC50
1.96±n/a nM
Citation
 Lee, HChun, KJoe, BKim, ESJang, ESOh, HKim, JPark, JLee, H Tricyclic derivative compound, method for preparing same, and pharmaceutical composition comprising same US Patent  US10464919 Publication Date 11/5/2019 
Target
Name:
Activated CDC42 kinase 1
Synonyms:
ACK1 Activated CDC42 kinase 1 (ACK-1) Tyrosine kinase non-receptor protein 2
Type:
Protein
Mol. Mass.:
114577.86
Organism:
Homo sapiens (Human)
Description:
Q07912
Residue:
1038
  
Inhibitor
Name:
BDBM419832
Synonyms:
US10464919, Example 170
Type:
Small organic molecule
Emp. Form.:
C23H23FN6O
Mol. Mass.:
418.4667
SMILES:
Fc1cc(CN2CCN(CC2)c2ccc(cn2)C#N)cc2[nH]c(=O)c3CCCNc3c12
: