Target
Proto-oncogene tyrosine-protein kinase receptor Ret [V804M]
Ligand
BDBM296727
Substrate
IC50
11.9±n/a nM
Citation
 Andrews, SWAronow, SBlake, JFBrandhuber, BJCook, AHaas, JJiang, YKolakowski, GRMcFaddin, EAMcKenney, MLMcNulty, OTMetcalf, ATMoreno, DATang, TPRen, L Substituted pyrazolo[1,5-A]pyridine compounds as RET kinase inhibitors US Patent  US10112942 Publication Date 10/30/2018 
Target
Name:
Proto-oncogene tyrosine-protein kinase receptor Ret [V804M]
Synonyms:
CDHF12 PTC RET RET51 ret enzyme (v804m)
Type:
Enzyme Catalytic Domain
Mol. Mass.:
124350.36
Organism:
Homo sapiens (Human)
Description:
P07949[V804M]
Residue:
1114
  
Inhibitor
Name:
BDBM296727
Synonyms:
US10112942, Example 462 US10172851, Example 462 US10953005, Example 462
Type:
Small organic molecule
Emp. Form.:
C31H34N8O2
Mol. Mass.:
550.6541
SMILES:
COc1ccc(CN2C3CC2CN(C3)c2ccc(cn2)-c2cc(OCCC3CN(C)C3)cn3ncc(C#N)c23)cn1
: