Target
Lysine-specific histone demethylase 1A
Ligand
BDBM296887
Substrate
Meas. Tech.
LSD1 Histone Demethylase Biochemical Assay
pH
7.5±n/a
IC50
<50±n/a nM
Comments
extracted
Citation
 Wu, LCourter, JRHe, CLi, JLu, LSun, YWang, XYao, WZhang, CZhuo, J Substituted imidazo[1,2-a]pyrazines as LSD1 inhibitors US Patent  US10112950 Publication Date 10/30/2018 
Target
Name:
Lysine-specific histone demethylase 1A
Synonyms:
AOF2 Flavin-containing amine oxidase domain-containing protein 2 KDM1A KIAA0601 Lysine-specific demethylase 1 (LSD1) Lysine-specific histone demethylase 1 (LSD1)
Type:
Enzyme
Mol. Mass.:
92901.01
Organism:
Homo sapiens (Human)
Description:
O60341
Residue:
852
  
Inhibitor
Name:
BDBM296887
Synonyms:
4-[8-(2,7-diazaspiro[3.5]non-7-yl)-5-(4-methylphenyl)imidazo[1,2-a]pyrazin-6-yl]benzonitrile | US10112950, Example 20
Type:
Small organic molecule
Emp. Form.:
C27H26N6
Mol. Mass.:
434.5355
SMILES:
Cc1ccc(cc1)-c1c(nc(N2CCC3(CNC3)CC2)c2nccn12)-c1ccc(cc1)[N+]#[C-]
: