Target
Dual specificity calcium/calmodulin-dependent 3',5'-cyclic nucleotide phosphodiesterase 1B
Ligand
BDBM279111
Substrate
Meas. Tech.
PDE1 Inhibition Assay
IC50
0.100±n/a nM
Citation
 Kehler, JJuhl, KMarigo, MVital, PJJessing, MLanggård, MRasmussen, LKClementson, CM 1 H-pyrazolo[4,3-B]pyridines as PDE1 inhibitors US Patent  US10512632 Publication Date 12/24/2019 
Target
Name:
Dual specificity calcium/calmodulin-dependent 3',5'-cyclic nucleotide phosphodiesterase 1B
Synonyms:
63 kDa Cam-PDE Calcium/calmodulin-dependent 3',5'-cyclic nucleotide phosphodiesterase 1B PDE1B PDE1B_HUMAN Phosphodiesterase 1B Phosphodiesterase Type 1 (PDE1B) | Phosphodiesterase, PDE1/PDE5
Type:
Enzyme
Mol. Mass.:
61366.51
Organism:
Homo sapiens (Human)
Description:
Residue:
536
  
Inhibitor
Name:
BDBM279111
Synonyms:
1-isopropyl-3-methyl-N-[(1-methylimidazol-4-yl)methyl]-5-(2-propoxy-3-pyridyl)pyrazolo[4,3-b]pyridin-7-amine US10512632, Example 142 US10806718, Example 142 US11634416, Example 142
Type:
Small organic molecule
Emp. Form.:
C23H29N7O
Mol. Mass.:
419.5227
SMILES:
CCCOc1ncccc1-c1cc(NCc2cn(C)cn2)c2n(nc(C)c2n1)C(C)C
: