Target
Probable G-protein coupled receptor 139
Ligand
BDBM263484
Substrate
Meas. Tech.
Competition Binding Assay
Ki
39000±n/a nM
Citation
 Hitchcock, SLam, BMonenschein, HReichard, H 4-oxo-3,4-dihydro-1,2,3-benzotriazine modulators of GPR139 US Patent  US10561662 Publication Date 2/18/2020 
Target
Name:
Probable G-protein coupled receptor 139
Synonyms:
G(q)-coupled orphan receptor GPRg1 G-protein-coupled receptor PGR3 GPR139 GPRG1 Probable G-protein coupled receptor 139
Type:
PROTEIN
Mol. Mass.:
40700.34
Organism:
Homo sapiens (Human)
Description:
ChEMBL_109920
Residue:
353
  
Inhibitor
Name:
BDBM263484
Synonyms:
(s)?n-(1-(2,4-dimethylphenyl)ethyl)-2-(6-fluoro-4-oxobenzo[d][1,2,3]triazin-3(4h)-yl)acetamide US11173161, EX 52 | US9556130, test 52
Type:
Small organic molecule
Emp. Form.:
C19H19FN4O2
Mol. Mass.:
354.3782
SMILES:
C[C@H](NC(=O)Cn1nnc2ccc(F)cc2c1=O)c1ccc(C)cc1C
: