Target
Diacylglycerol lipase-beta
Ligand
BDBM434887
Substrate
Meas. Tech.
In Vitro Inhibition of DAGL
IC50
6000±n/a nM
Citation
 Cravatt, BFOgasawara, DViader, ADeng, HVan Der Wel, TVan Der Stelt, M Triazole DAGLα inhibitors US Patent  US10583137 Publication Date 3/10/2020 
Target
Name:
Diacylglycerol lipase-beta
Synonyms:
DAGLB Sn1-specific diacylglycerol lipase beta
Type:
PROTEIN
Mol. Mass.:
73731.79
Organism:
Homo sapiens (Human)
Description:
ChEMBL_557688
Residue:
672
  
Inhibitor
Name:
BDBM434887
Synonyms:
(2-benzylpiperidin-1-yl)(4-(2',4'- dimethoxy-[1,1'-biphenyl]-4-yl)- 1H-1,2,3-triazol-1-yl)methanone | US10583137, Compound 62
Type:
Small organic molecule
Emp. Form.:
C29H30N4O3
Mol. Mass.:
482.5735
SMILES:
COc1ccc(c(OC)c1)-c1ccc(cc1)-c1cn(nn1)C(=O)N1CCCCC1Cc1ccccc1
: