Target
Diacylglycerol lipase-alpha
Ligand
BDBM434893
Substrate
Meas. Tech.
In Vitro Inhibition of DAGL
IC50
<400±n/a nM
Citation
 Cravatt, BFOgasawara, DViader, ADeng, HVan Der Wel, TVan Der Stelt, M Triazole DAGLα inhibitors US Patent  US10583137 Publication Date 3/10/2020 
Target
Name:
Diacylglycerol lipase-alpha
Synonyms:
C11orf11 DGLA_HUMAN NSDDR | Sn1-specific diacylglycerol lipase alpha
Type:
PROTEIN
Mol. Mass.:
114947.74
Organism:
Homo sapiens (Human)
Description:
ChEMBL_1449471
Residue:
1042
  
Inhibitor
Name:
BDBM434893
Synonyms:
(2-(pyridin-4- ylmethyl)piperidin-1-yl)(4- (2',4',6'-trimethoxy-[1,1'- biphenyl]-4-yl)-1H-1,2,3-triazol- 1-yl)methanone | US10583137, Compound 67
Type:
Small organic molecule
Emp. Form.:
C29H31N5O4
Mol. Mass.:
513.5875
SMILES:
COc1cc(OC)c(c(OC)c1)-c1ccc(cc1)-c1cn(nn1)C(=O)N1CCCCC1Cc1ccncc1
: