Target
Transient receptor potential cation channel subfamily M member 8
Ligand
BDBM435188
Substrate
Meas. Tech.
Assay on TRPM8 Modulators
EC50
700±n/a nM
Citation
 Subkowski, TBackes, MOertling, HMachinek, ALoges, HSimchen, USurburg, HBollschweiler, CWittenberg, JSiegel, W Use of physiological cooling active ingredients, and agents containing such active ingredients US Patent  US10584134 Publication Date 3/10/2020 
Target
Name:
Transient receptor potential cation channel subfamily M member 8
Synonyms:
LTRPC6 TRPM8_HUMAN Transient receptor potential M8 protein (TRPM8) Transient receptor potential cation channel subfamily M member 8 (TRPM8)
Type:
Enzyme
Mol. Mass.:
127693.26
Organism:
Homo sapiens (Human)
Description:
Q7Z2W7
Residue:
1104
  
Inhibitor
Name:
BDBM435188
Synonyms:
US10584134, Example 3-12
Type:
Small organic molecule
Emp. Form.:
C22H18N2O3
Mol. Mass.:
358.3899
SMILES:
O=C(\C=C\c1ccc2OCOc2c1)N(Cc1ccccc1)c1ccccn1
: