Target
Transient receptor potential cation channel subfamily M member 8
Ligand
BDBM435214
Substrate
Meas. Tech.
Assay on TRPM8 Modulators
EC50
1800±n/a nM
Citation
 Subkowski, TBackes, MOertling, HMachinek, ALoges, HSimchen, USurburg, HBollschweiler, CWittenberg, JSiegel, W Use of physiological cooling active ingredients, and agents containing such active ingredients US Patent  US10584134 Publication Date 3/10/2020 
Target
Name:
Transient receptor potential cation channel subfamily M member 8
Synonyms:
LTRPC6 TRPM8_HUMAN Transient receptor potential M8 protein (TRPM8) Transient receptor potential cation channel subfamily M member 8 (TRPM8)
Type:
Enzyme
Mol. Mass.:
127693.26
Organism:
Homo sapiens (Human)
Description:
Q7Z2W7
Residue:
1104
  
Inhibitor
Name:
BDBM435214
Synonyms:
US10584134, Example 3-36
Type:
Small organic molecule
Emp. Form.:
C19H21NO
Mol. Mass.:
279.3761
SMILES:
CC(C)N(C(=O)\C=C\c1ccc(C)cc1)c1ccccc1
: