Target
Transient receptor potential cation channel subfamily M member 8
Ligand
BDBM435217
Substrate
Meas. Tech.
Assay on TRPM8 Modulators
EC50
2600±n/a nM
Citation
 Subkowski, TBackes, MOertling, HMachinek, ALoges, HSimchen, USurburg, HBollschweiler, CWittenberg, JSiegel, W Use of physiological cooling active ingredients, and agents containing such active ingredients US Patent  US10584134 Publication Date 3/10/2020 
Target
Name:
Transient receptor potential cation channel subfamily M member 8
Synonyms:
LTRPC6 TRPM8_HUMAN Transient receptor potential M8 protein (TRPM8) Transient receptor potential cation channel subfamily M member 8 (TRPM8)
Type:
Enzyme
Mol. Mass.:
127693.26
Organism:
Homo sapiens (Human)
Description:
Q7Z2W7
Residue:
1104
  
Inhibitor
Name:
BDBM435217
Synonyms:
US10584134, Example 3-39
Type:
Small organic molecule
Emp. Form.:
C23H27NO3
Mol. Mass.:
365.4654
SMILES:
COc1cccc(\C=C\C(=O)N(C2CCCCC2)c2ccccc2)c1OC
: