Target
CREB-binding protein
Ligand
BDBM437420
Substrate
Meas. Tech.
In Vitro CBP Inhibition
IC50
<500±n/a nM
Citation
 Trzoss, LBetancort, JMKanouni, TWallace, MBBoloor, A Therapeutic compounds US Patent  US10617680 Publication Date 4/14/2020 
Target
Name:
CREB-binding protein
Synonyms:
CBP CREB-binding protein (CBP) CREBBP
Type:
Transcription Coactivator
Mol. Mass.:
265411.66
Organism:
Homo sapiens (Human)
Description:
Q92793
Residue:
2442
  
Inhibitor
Name:
BDBM437420
Synonyms:
4-[5-(1-Cyclopropylmethyl-1H-pyrazol-4-yl)-1-methyl-2-oxo- 1,2-dihydro-pyridin-4-yl]-benzoic acid US11020380, Example 154
Type:
Small organic molecule
Emp. Form.:
C20H19N3O3
Mol. Mass.:
349.3832
SMILES:
Cn1cc(-c2cnn(CC3CC3)c2)c(cc1=O)-c1ccc(cc1)C(O)=O
: