Target
CREB-binding protein
Ligand
BDBM437452
Substrate
Meas. Tech.
In Vitro CBP Inhibition
IC50
<500±n/a nM
Citation
 Trzoss, LBetancort, JMKanouni, TWallace, MBBoloor, A Therapeutic compounds US Patent  US10617680 Publication Date 4/14/2020 
Target
Name:
CREB-binding protein
Synonyms:
CBP CREB-binding protein (CBP) CREBBP
Type:
Transcription Coactivator
Mol. Mass.:
265411.66
Organism:
Homo sapiens (Human)
Description:
Q92793
Residue:
2442
  
Inhibitor
Name:
BDBM437452
Synonyms:
5-(3-amino-1-benzyl-1H-pyrazol-4-yl)-4-ethoxy-1- methylpyridin-2(1H)-one US11020380, Example 186
Type:
Small organic molecule
Emp. Form.:
C18H20N4O2
Mol. Mass.:
324.377
SMILES:
CCOc1cc(=O)n(C)cc1-c1cn(Cc2ccccc2)nc1N
: