Target
Dual specificity calcium/calmodulin-dependent 3',5'-cyclic nucleotide phosphodiesterase 1A
Ligand
BDBM279132
Substrate
Meas. Tech.
PDE1 Inhibition Assay
IC50
120±n/a nM
Citation
 Juhl, KJessing, MLanggård, MVital, PJKehler, JRasmussen, LKClementson, CMMarigo, M Macrocycles as PDE1 inhibitors US Patent  US10618913 Publication Date 4/14/2020 
Target
Name:
Dual specificity calcium/calmodulin-dependent 3',5'-cyclic nucleotide phosphodiesterase 1A
Synonyms:
61 kDa Cam-PDE Cam-PDE 1A PDE1A_HUMAN | hCam-1
Type:
Protein
Mol. Mass.:
61245.69
Organism:
Homo sapiens (Human)
Description:
P54750
Residue:
535
  
Inhibitor
Name:
BDBM279132
Synonyms:
5-(2-ethoxy-3-pyridyl)-3-methyl-N-[(1-methyl-1,2,4-triazol-3-yl)methyl]-1-(oxetan-3-yl)pyrazolo[4,3-b]pyridin-7-amine US10512632, Example 163 US10766893, Example S163 US11026923, Example 163 US11634416, Example 163
Type:
Small organic molecule
Emp. Form.:
C21H24N8O2
Mol. Mass.:
420.4677
SMILES:
CCOc1ncccc1-c1cc(NCc2ncn(C)n2)c2n(nc(C)c2n1)C1COC1
: