Target
Dual specificity calcium/calmodulin-dependent 3',5'-cyclic nucleotide phosphodiesterase 1A
Ligand
BDBM279169
Substrate
Meas. Tech.
PDE1 Inhibition Assay
IC50
98.0±n/a nM
Citation
 Juhl, KJessing, MLanggård, MVital, PJKehler, JRasmussen, LKClementson, CMMarigo, M Macrocycles as PDE1 inhibitors US Patent  US10618913 Publication Date 4/14/2020 
Target
Name:
Dual specificity calcium/calmodulin-dependent 3',5'-cyclic nucleotide phosphodiesterase 1A
Synonyms:
61 kDa Cam-PDE Cam-PDE 1A PDE1A_HUMAN | hCam-1
Type:
Protein
Mol. Mass.:
61245.69
Organism:
Homo sapiens (Human)
Description:
P54750
Residue:
535
  
Inhibitor
Name:
BDBM279169
Synonyms:
1-isopropyl-3-methyl-N-((1-methyl-1H-pyrazol-4-yl)methyl)-5-(4-methyloxazol-5-yl)-1H-pyrazolo[4,3-b]pyridin-7-amine US10512632, Example 200 US10766893, Example S200 US11026923, Example 200 US11634416, Example 200
Type:
Small organic molecule
Emp. Form.:
C19H23N7O
Mol. Mass.:
365.4322
SMILES:
CC(C)n1nc(C)c2nc(cc(NCc3cnn(C)c3)c12)-c1ocnc1C
: