Target
Histone-arginine methyltransferase CARM1
Ligand
BDBM440540
Substrate
Meas. Tech.
Enzyme Assay
IC50
<100±n/a nM
Citation
 Chesworth, RMoradei, OMShapiro, GJin, LBabine, RE CARM1 inhibitors and uses thereof US Patent  US10633389 Publication Date 4/28/2020 
Target
Name:
Histone-arginine methyltransferase CARM1
Synonyms:
CARM1 Coactivator-associated arginine methyltransferase 1 PRMT4 Protein arginine methyltransferase 4 (PRMT4)
Type:
Protein
Mol. Mass.:
65855.47
Organism:
Homo sapiens (Human)
Description:
Q86X55
Residue:
608
  
Inhibitor
Name:
BDBM440540
Synonyms:
US10633389, Example 206-3 | US20230279020, Example 206-3
Type:
Small organic molecule
Emp. Form.:
C23H27ClFN5O3
Mol. Mass.:
475.944
SMILES:
CNC[C@@H](O)COc1ccc(Cl)c(c1)-c1nc(N2CC(F)C2)c(C)c(n1)-c1c(C)noc1C
: