Target
Fibroblast growth factor receptor 1
Ligand
BDBM443225
Substrate
Meas. Tech.
Inhibition Assay
IC50
544±n/a nM
Citation
 Chen, LGuan, DBai, HGou, JZhao, WWang, ZLing, LMa, Y Pyrimidine derivative, method for preparing same and use thereof in medicine US Patent  US10654836 Publication Date 5/19/2020 
Target
Name:
Fibroblast growth factor receptor 1
Synonyms:
BFGFR Basic fibroblast growth factor receptor 1 (FGFR1) CEK FGFR-1 FGFR-1, (FL) FGFR1_HUMAN FLT2 Fibroblast growth factor receptor 1 (FGFR-1) Fms-like tyrosine kinase 2 N-sam bFGF-R | c-fgr
Type:
Receptor
Mol. Mass.:
91861.70
Organism:
Homo sapiens (Human)
Description:
P11362
Residue:
822
  
Inhibitor
Name:
BDBM443225
Synonyms:
N-(2-((6-(3-(2,6-Dichloro-3,5-dimethoxyphenyl)-1-methylureido)pyrimidin-4-yl)amino)-5-(7-ethyl-2,7-diazaspiro[4.4]nonan-2-yl)phenyl)acrylamide US11001572, Example 6
Type:
Small organic molecule
Emp. Form.:
C32H38Cl2N8O4
Mol. Mass.:
669.601
SMILES:
CCN1CCC2(CCN(C2)c2ccc(Nc3cc(ncn3)N(C)C(=O)Nc3c(Cl)c(OC)cc(OC)c3Cl)c(NC(=O)C=C)c2)C1
: