Target
Complement factor D
Ligand
BDBM443483
Substrate
Meas. Tech.
Inhibition Assay
IC50
<1000±n/a nM
Citation
 Wiles, JAPhadke, ASDeshpande, MAgarwal, AChen, DGadhachanda, VRHashimoto, APais, GWang, QWang, X Amino compounds for treatment of medical disorders US Patent  US10660876 Publication Date 5/26/2020 
Target
Name:
Complement factor D
Synonyms:
Adipsin CFAD_HUMAN DF Properdin factor D
Type:
Protein
Mol. Mass.:
27039.19
Organism:
Homo sapiens (Human)
Description:
P00746
Residue:
253
  
Inhibitor
Name:
BDBM443483
Synonyms:
(2S,4R)-1-(2-(3- acetyl-5- (pyridin-3- ylamino)-1H- indol-1- yl)acetyl)-4- fluoro-N- phenethylpyrrolidin- 2-carboxamide | US10660876, Cmpd No. 148
Type:
Small organic molecule
Emp. Form.:
C30H30FN5O3
Mol. Mass.:
527.5893
SMILES:
CC(=O)c1cn(CC(=O)N2C[C@H](F)C[C@H]2C(=O)NCCc2ccccc2)c2ccc(Nc3cccnc3)cc12
: