Target
Plasminogen [101-181]
Ligand
BDBM290296
Substrate
Meas. Tech.
Plasma-Based Clot Lysis Assay
IC50
24.0±n/a nM
Citation
 Haßfeld, JKinzel, TKöbberling, JCancho-Grande, YBeyer, KRöhrig, SKöllnberger, MSperzel, MBurkhardt, NSchlemmer, KStegmann, CSchuhmacher, JWerner, MEllermann, M (Aza)pyridopyrazolopyrimidinones and indazolopyrimidinones and their use US Patent  US10668071 Publication Date 6/2/2020 
Target
Name:
Plasminogen [101-181]
Synonyms:
PLG Plasminogen (aa 101-181)
Type:
Enzyme Catalytic Domain
Mol. Mass.:
9281.08
Organism:
Homo sapiens (Human)
Description:
P00747[101-181]
Residue:
81
  
Inhibitor
Name:
BDBM290296
Synonyms:
8-Chloro-4-(piperidin-4-yl)pyrimido[1,2-b]indazol-2(1H)-one hydrochloride US10668071, Example 39
Type:
Small organic molecule
Emp. Form.:
C15H15ClN4O
Mol. Mass.:
302.759
SMILES:
Clc1ccc2c(c1)nn1c(cc(=O)[nH]c21)C1CCNCC1
: