Target
Plasminogen [101-181]
Ligand
BDBM290348
Substrate
Meas. Tech.
Plasma-Based Clot Lysis Assay
IC50
27.0±n/a nM
Citation
 Haßfeld, JKinzel, TKöbberling, JCancho-Grande, YBeyer, KRöhrig, SKöllnberger, MSperzel, MBurkhardt, NSchlemmer, KStegmann, CSchuhmacher, JWerner, MEllermann, M (Aza)pyridopyrazolopyrimidinones and indazolopyrimidinones and their use US Patent  US10668071 Publication Date 6/2/2020 
Target
Name:
Plasminogen [101-181]
Synonyms:
PLG Plasminogen (aa 101-181)
Type:
Enzyme Catalytic Domain
Mol. Mass.:
9281.08
Organism:
Homo sapiens (Human)
Description:
P00747[101-181]
Residue:
81
  
Inhibitor
Name:
BDBM290348
Synonyms:
4-(Piperidin-4-yl)-10-(1H-1,2,4-triazol-1-yl)pyrimido[1,2-b]indazol-2(1H)-one hydrochloride US10668071, Example 91
Type:
Small organic molecule
Emp. Form.:
C17H17N7O
Mol. Mass.:
335.3632
SMILES:
O=c1cc(C2CCNCC2)n2nc3cccc(-n4cncn4)c3c2[nH]1
: