Target
Isocitrate dehydrogenase [NADP] cytoplasmic
Ligand
BDBM445388
Substrate
Meas. Tech.
Kinase Assay
IC50
<100±n/a nM
Citation
 Jiang, LGeng, MZheng, QHuang, MWan, HTang, SFu, XLan, XCao, JLiu, FDing, J Compound having mutant IDH inhibitory activity, preparation method and use thereof US Patent  US10682352 Publication Date 6/16/2020 
Target
Name:
Isocitrate dehydrogenase [NADP] cytoplasmic
Synonyms:
Cytosolic NADP-isocitrate dehydrogenase IDH1 IDP Isocitrate dehydrogenase 1 (IDH1) Oxalosuccinate decarboxylase | PICD
Type:
Protein
Mol. Mass.:
46661.29
Organism:
Homo sapiens (Human)
Description:
O75874
Residue:
414
  
Inhibitor
Name:
BDBM445388
Synonyms:
(S)-5-isopropyl-4,4-dimethyl-1-(2-(((S)-1-(1-(4-(trifluoromethyl)phenyl)-1H-imidazole)-4-yl)ethyl)amino)pyrimidin-4-yl)imidazolidine-2-one | US10682352, Compound 101
Type:
Small organic molecule
Emp. Form.:
C24H28F3N7O
Mol. Mass.:
487.5206
SMILES:
CC(C)[C@@H]1N(C(=O)NC1(C)C)c1ccnc(N[C@@H](C)c2cn(cn2)-c2ccc(cc2)C(F)(F)F)n1
: