Target
Mitogen-activated protein kinase kinase kinase 5
Ligand
BDBM445448
Substrate
Meas. Tech.
HTRF KinEASE Assay
IC50
5.5±n/a nM
Citation
 Wang, GShen, RLong, JMa, JXing, XHe, YGranger, BHe, JWang, BOr, YS Apoptosis signal-regulating kinase 1 inhibitors and methods of use thereof US Patent  US10683279 Publication Date 6/16/2020 
Target
Name:
Mitogen-activated protein kinase kinase kinase 5
Synonyms:
ASK1 MAP3K5 MEKK5
Type:
Protein
Mol. Mass.:
154514.93
Organism:
Homo sapiens (Human)
Description:
Q99683
Residue:
1374
  
Inhibitor
Name:
BDBM445448
Synonyms:
US10683279, Example 45a US11560368, Example 45a
Type:
Small organic molecule
Emp. Form.:
C23H26N10O2S
Mol. Mass.:
506.583
SMILES:
CC(C)n1nnnc1-c1nc(NC(=O)c2cc(c(cn2)N2CCOCC2)-n2cnc(c2)C2CC2)cs1
: