Target
Mitogen-activated protein kinase kinase kinase 5
Ligand
BDBM445494
Substrate
Meas. Tech.
HTRF KinEASE Assay
IC50
55±n/a nM
Citation
 Granger, BWang, GShen, RHe, JOr, YS Apoptosis signal-regulating kinase 1 inhibitors and methods of use thereof US Patent  US10683289 Publication Date 6/16/2020 
Target
Name:
Mitogen-activated protein kinase kinase kinase 5
Synonyms:
ASK1 MAP3K5 MEKK5
Type:
Protein
Mol. Mass.:
154514.93
Organism:
Homo sapiens (Human)
Description:
Q99683
Residue:
1374
  
Inhibitor
Name:
BDBM445494
Synonyms:
US10683289, Example 15
Type:
Small organic molecule
Emp. Form.:
C19H19FN6O3S
Mol. Mass.:
430.456
SMILES:
CC(C)n1cnnc1-c1cccc(NC(=O)c2cc3c(CN(C)S3(=O)=O)cc2F)n1
: